基本的に怠Diary

学習ログを残したい

療養中

人生つらい

もうダメ

仕事やめて旅にでたい。ベーシックインカム欲しい。

そうだ!希望の党

希望の党こそこの荒廃した世の中を変えてくれる!!!!!!!!!!!!!!!!!!!!!!!

もっと素晴らしい社会へと変えてくれる!!!!!!!!!!!!!!!!!

小池さんは救世主!!!!!日本の恥なのでそろそろやめてね。

政治ネタは拗れるので良い子のみんなは会話で絶対出すなよ。

きっと良いことにはならないぞ。

後野球ネタ。宗教はいう必要ないよね。

これらをドヤ顔で語り始める人がいたら近づかない方がよい。

僕はそうしてる。


療養とかするつもりなかったけど僕のヒーローアカデミアがエロかったのと

食戟のソーマがエロかったことに加えてらずぱいでがんばるびぃできなかったのでダメだった。

わからん。

???「・・・ろ」

ぼく「・・・?」

nkf「ログを確認しろ」

Downloading yaml-0.1.6.tar.gz...
-> https://dqw8nmjcqpjn7.cloudfront.net/7da6971b4bd08a986dd2a61353bc422362bd0edcc67d7ebaac68c95f74182749
Installing yaml-0.1.6...
Installed yaml-0.1.6 to /home/pi/.rbenv/versions/2.1.0

Downloading ruby-2.1.0.tar.bz2...
-> https://cache.ruby-lang.org/pub/ruby/2.1/ruby-2.1.0.tar.bz2
Installing ruby-2.1.0...

WARNING: ruby-2.1.0 is past its end of life and is now unsupported.
It no longer receives bug fixes or critical security updates.


BUILD FAILED (Raspbian 9.1 using ruby-build 20170914-2-ge40cd1f)

Inspect or clean up the working tree at /tmp/ruby-build.20171006122658.27998
Results logged to /tmp/ruby-build.20171006122658.27998.log

Last 10 log lines:
make[1]: *** [ext/openssl/all] Error 2
make[1]: *** Waiting for unfinished jobs....
installing default objspace libraries
linking shared-object objspace.so
make[2]: Leaving directory '/tmp/ruby-build.20171006122658.27998/ruby-2.1.0/ext/objspace'
linking shared-object nkf.so
make[2]: Leaving directory '/tmp/ruby-build.20171006122658.27998/ruby-2.1.0/ext/nkf'
make[1]: Leaving directory '/tmp/ruby-build.20171006122658.27998/ruby-2.1.0'
uncommon.mk:180: recipe for target 'build-ext' failed
make: *** [build-ext] Error 2

2人は素敵なインストールして終了。

文才有りすぎて困る。

そうはいかないのが現実である。

エラーの次はエラー。

github.com

ラブライブサンシャインを見ながら苦しみながらインターネッツの海を後悔していたら

見つけた。いやもっと早くみてね。

CC=/usr/bin/gcc-6 rbenv install 2.4.0

いった。くっそ長かった。

このまま2.3.0いれて今日はねよう